درود مهمان گرامی! ثبت نام

امتیاز موضوع:
  • 0 رأی - میانگین امتیازات: 0
  • 1
  • 2
  • 3
  • 4
  • 5
مشکل خروجی اندروید(کمکک)
#1
Sad 
اقا من ۲ساله موندم نمیتونم خروجی بگیرم یکی به من عاجز کمک کنه sad
Reading project file....finished.
Compile Constants...finished.
Remove DnD...finished.
Compile Scripts...finished.
Compile Objects...finished.
Compile Timelines...finished.
Compile Triggers...finished.
Compile Rooms...finished.
Compile Extensions...finished.
Global scripts...finished.
Final Compile...finished.
Saving IFF file... C:\Users\Digi-Plus\AppData\Local\Temp\gm_ttt_15900\gm_ttt_48513\Project3.droid
Writing Chunk... GEN8
Writing Chunk... OPTN
Writing Chunk... LANG
Writing Chunk... EXTN
Writing Chunk... SOND
Writing Chunk... AGRP
Writing Chunk... SPRT
Writing Chunk... BGND
Writing Chunk... PATH
Writing Chunk... SCPT
Writing Chunk... GLOB
Writing Chunk... SHDR
Writing Chunk... FONT
Writing Chunk... TMLN
Writing Chunk... OBJT
Writing Chunk... ROOM
Writing Chunk... DAFL
Writing Chunk... TPAGE
Writing Chunk... CODE
Writing Chunk... VARI
Writing Chunk... FUNC
Writing Chunk... STRG
Writing Chunk... TXTR
0 Compressing texture... writing texture texture_0.png... 
Writing Chunk... AUDO
Writing Chunk... SCPT
Writing Chunk... DBGI
Writing Chunk... INST
Writing Chunk... LOCL
Writing Chunk... STRG
Stats : GMA : Elapsed=2596/3677
Stats : GMA : sp=7,au=0,bk=0,pt=0,sc=0,sh=0,fo=0,tl=0,ob=7,ro=1,da=0,ex=0,ma=3,fm=0x40
cmd /c "subst Z: "C:\Users\Digi-Plus\Documents\GameMaker\Cache\Project3\Android\Default" && Z: && cd \com.companyname.Project3 && "C:\Users\Digi-Plus\Desktop\apps\GameMaker Studio Master Collection 1.4.1760 Windows\Setup\Android\runner\gradle\gradlew"  assembleRelease lint "


FAILURE: Build failed with an exception.

* What went wrong:
A problem occurred configuring root project ''.
> Could not resolve all dependencies for configuration ':classpath'.
   > Could not resolve com.android.tools.build:gradle:2.1.0.
     Required by:
         ::unspecified
      > Could not resolve com.android.tools.build:gradle:2.1.0.
         > Could not get resource 'https://jcenter.bintray.com/com/android/tools/build/gradle/2.1.0/gradle-2.1.0.pom'.
            > Could not GET 'https://jcenter.bintray.com/com/android/tools/build/gradle/2.1.0/gradle-2.1.0.pom'.
               > peer not authenticated
   > Could not resolve com.google.gms:google-services:3.0.0.
     Required by:
         ::unspecified
      > Could not resolve com.google.gms:google-services:3.0.0.
         > Could not get resource 'https://jcenter.bintray.com/com/google/gms/google-services/3.0.0/google-services-3.0.0.pom'.
            > Could not GET 'https://jcenter.bintray.com/com/google/gms/google-services/3.0.0/google-services-3.0.0.pom'.
               > peer not authenticated

* Try:
Run with --stacktrace option to get the stack trace. Run with --info or --debug option to get more log output.

BUILD FAILED

Total time: 19.274 secs
cmd /c "subst /d Z:"

Lint Build report available at C:\Users\Digi-Plus\Documents\GameMaker\Cache\Project3\Android\Default\com.companyname.Project3\build\outputs\lint-results.html
Create finished: 04:37:16 ق.ظ


resim resim resim
پاسخ
#2
(9/5/1398، 08:24 عصر)hesamtmr نوشته است: اقا من ۲ساله موندم نمیتونم خروجی بگیرم یکی به من عاجز کمک کنه sad
Reading project file....finished.
Compile Constants...finished.
Remove DnD...finished.
Compile Scripts...finished.
Compile Objects...finished.
Compile Timelines...finished.
Compile Triggers...finished.
Compile Rooms...finished.
Compile Extensions...finished.
Global scripts...finished.
Final Compile...finished.
Saving IFF file... C:\Users\Digi-Plus\AppData\Local\Temp\gm_ttt_15900\gm_ttt_48513\Project3.droid
Writing Chunk... GEN8
Writing Chunk... OPTN
Writing Chunk... LANG
Writing Chunk... EXTN
Writing Chunk... SOND
Writing Chunk... AGRP
Writing Chunk... SPRT
Writing Chunk... BGND
Writing Chunk... PATH
Writing Chunk... SCPT
Writing Chunk... GLOB
Writing Chunk... SHDR
Writing Chunk... FONT
Writing Chunk... TMLN
Writing Chunk... OBJT
Writing Chunk... ROOM
Writing Chunk... DAFL
Writing Chunk... TPAGE
Writing Chunk... CODE
Writing Chunk... VARI
Writing Chunk... FUNC
Writing Chunk... STRG
Writing Chunk... TXTR
0 Compressing texture... writing texture texture_0.png... 
Writing Chunk... AUDO
Writing Chunk... SCPT
Writing Chunk... DBGI
Writing Chunk... INST
Writing Chunk... LOCL
Writing Chunk... STRG
Stats : GMA : Elapsed=2596/3677
Stats : GMA : sp=7,au=0,bk=0,pt=0,sc=0,sh=0,fo=0,tl=0,ob=7,ro=1,da=0,ex=0,ma=3,fm=0x40
cmd /c "subst Z: "C:\Users\Digi-Plus\Documents\GameMaker\Cache\Project3\Android\Default" && Z: && cd \com.companyname.Project3 && "C:\Users\Digi-Plus\Desktop\apps\GameMaker Studio Master Collection 1.4.1760 Windows\Setup\Android\runner\gradle\gradlew"  assembleRelease lint "


FAILURE: Build failed with an exception.

* What went wrong:
A problem occurred configuring root project ''.
> Could not resolve all dependencies for configuration ':classpath'.
   > Could not resolve com.android.tools.build:gradle:2.1.0.
     Required by:
         ::unspecified
      > Could not resolve com.android.tools.build:gradle:2.1.0.
         > Could not get resource 'https://jcenter.bintray.com/com/android/tools/build/gradle/2.1.0/gradle-2.1.0.pom'.
            > Could not GET 'https://jcenter.bintray.com/com/android/tools/build/gradle/2.1.0/gradle-2.1.0.pom'.
               > peer not authenticated
   > Could not resolve com.google.gms:google-services:3.0.0.
     Required by:
         ::unspecified
      > Could not resolve com.google.gms:google-services:3.0.0.
         > Could not get resource 'https://jcenter.bintray.com/com/google/gms/google-services/3.0.0/google-services-3.0.0.pom'.
            > Could not GET 'https://jcenter.bintray.com/com/google/gms/google-services/3.0.0/google-services-3.0.0.pom'.
               > peer not authenticated

* Try:
Run with --stacktrace option to get the stack trace. Run with --info or --debug option to get more log output.

BUILD FAILED

Total time: 19.274 secs
cmd /c "subst /d Z:"

Lint Build report available at C:\Users\Digi-Plus\Documents\GameMaker\Cache\Project3\Android\Default\com.companyname.Project3\build\outputs\lint-results.html
Create finished: 04:37:16 ق.ظ


resim resim resim

سلام smiley
به نظر  میاد یه سری فایل ها رو کم داره. باید هنگام خروجی به اینترنت وصل باشی تا اونا رو یک بار برای همیشه دانلود کنه. البته اینترنت خالی خالی هم نمیشه. teeth باید زدودکن هم داشته باشی. eek البته خیلی رمزی گفتم. منظورم همون نرم  افزاری هست که خیلی چیزا رو میشکونه. smiley 
امیدوارم مشکلت حل بشه. smiley
پاسخ
#3
از زود کن هم استفاده کردم امین ارور رو داد sad قبلا هم یبار استفاده کردم بازم کار نکرد،، میشه دوباره دانلود کنم یا باید حافظه رو پاک کنم درست دوباره دانلود کنه ،، اگه هست کجا رو باید پاک کنم
.... ممکنه از کی استور باشه؟؟

-من دو نسخه گیم میکر استادیو دارم یکی قدیمی و یکی جدید و جدیده گریدل میخواد که قبلا دان کردم

لطفا راهنماییم کنین
پاسخ


موضوعات مرتبط با این موضوع...
موضوع نویسنده پاسخ بازدید آخرین ارسال
  مشکل خروجی و تست گیم میکر استودیو amir719 5 2,170 31/4/1398، 03:01 عصر
آخرین ارسال: Hamid1225
  برگرداندن خروجی instance afshar 0 114 12/11/1397، 10:30 عصر
آخرین ارسال: afshar
Thumbs Down مشکل در نصب برنامه های اندروید ساخته شده با گیم میکر nima bagheri 2 167 17/9/1397، 08:06 عصر
آخرین ارسال: nima bagheri
  Error خروجی آندروید shahin1354 22 762 27/7/1397، 05:49 عصر
آخرین ارسال: imanbeik
  خطا در گرفتن خروجی آندروید shahin1354 26 753 20/6/1397، 05:50 عصر
آخرین ارسال: shahin1354



کاربرانِ درحال بازدید از این موضوع: 1 مهمان